{"text_format":"3","workbook":"xlsx","n_sheets":10,"sheets":["Driftskostnader","Viktig","Forutsetninger","Prosjektkostnader","Oppsummering","Gevinstestimat","Scoring","NPV & IRR detaljer","Cash flow diagram - full str","Factors"],"not_rendered":{"charts":6,"images":2,"macros":1,"defined_names":14,"comments":4},"unopened":[{"sheet":"Cash flow diagram - full str","index":8,"reason":"not_a_worksheet"}],"read":"whole","date_system":"1900"}

{"sheet":"Driftskostnader","index":0,"n_rows":57,"n_cols":10,"rows_kept":57,"merged":[[0,1,0,9],[51,1,51,2]]}
[null,{"$f":"\"Årlige endrede driftskostnader for \" &Oppsummering!B4:M4","v":"Årlige endrede driftskostnader for <Prosjektnavn>"}]
[null,2]
[]
[{"$nulls":3},"Lav","Sannsynlig","Høy","Forventet","Varians","Avvik"]
[{"$nulls":3},"a","m","b","E(x)","V(x)","a%","b%"]
[null,"Driftskostnader","Beskrivelse","MNOK","MNOK","MNOK"]
[{"$nulls":6},{"$f":"IF(AND(D7<>\"\",F7<>\"\"),IF(E7<>\"\",CHOOSE($B$2,(D7+3*E7+F7)/5,(D7+4*E7+F7)/6),(D7+F7)/2),E7)","v":{"v":0,"d":"0.0"}},{"$f":"CHOOSE($B$2,(F7-D7)^2/25,(F7-D7)^2/36)","v":{"v":0,"d":"0.0"}},{"$f":"IF(D7<>0, (1-D7/E7),\"\")","v":""},{"$f":"IF(D7<>0, (F7/E7-1),\"\")","v":""}]
[{"$nulls":6},{"$f":"IF(AND(D8<>\"\",F8<>\"\"),IF(E8<>\"\",CHOOSE($B$2,(D8+3*E8+F8)/5,(D8+4*E8+F8)/6),(D8+F8)/2),E8)","v":{"v":0,"d":"0.0"}},{"$f":"CHOOSE($B$2,(F8-D8)^2/25,(F8-D8)^2/36)","v":{"v":0,"d":"0.0"}},{"$f":"IF(D8<>0, (1-D8/E8),\"\")","v":""},{"$f":"IF(D8<>0, (F8/E8-1),\"\")","v":""}]
[{"$nulls":6},{"$f":"IF(AND(D9<>\"\",F9<>\"\"),IF(E9<>\"\",CHOOSE($B$2,(D9+3*E9+F9)/5,(D9+4*E9+F9)/6),(D9+F9)/2),E9)","v":{"v":0,"d":"0.0"}},{"$f":"CHOOSE($B$2,(F9-D9)^2/25,(F9-D9)^2/36)","v":{"v":0,"d":"0.0"}},{"$f":"IF(D9<>0, (1-D9/E9),\"\")","v":""},{"$f":"IF(D9<>0, (F9/E9-1),\"\")","v":""}]
[{"$nulls":6},{"v":0,"d":"0.0"},{"v":0,"d":"0.0"},"",""]
[{"$nulls":6},{"v":0,"d":"0.0"},{"v":0,"d":"0.0"},"",""]
[{"$nulls":6},{"v":0,"d":"0.0"},{"v":0,"d":"0.0"},"",""]
[{"$nulls":6},{"v":0,"d":"0.0"},{"v":0,"d":"0.0"},"",""]
[{"$nulls":6},{"v":0,"d":"0.0"},{"v":0,"d":"0.0"},"",""]
[{"$nulls":6},{"v":0,"d":"0.0"},{"v":0,"d":"0.0"},"",""]
[{"$nulls":6},{"v":0,"d":"0.0"},{"v":0,"d":"0.0"},"",""]
[{"$nulls":6},{"v":0,"d":"0.0"},{"v":0,"d":"0.0"},"",""]
[{"$nulls":6},{"v":0,"d":"0.0"},{"v":0,"d":"0.0"},"",""]
[{"$nulls":6},{"v":0,"d":"0.0"},{"v":0,"d":"0.0"},"",""]
[{"$nulls":6},{"v":0,"d":"0.0"},{"v":0,"d":"0.0"},"",""]
[{"$nulls":6},{"v":0,"d":"0.0"},{"v":0,"d":"0.0"},"",""]
[{"$nulls":6},{"v":0,"d":"0.0"},{"v":0,"d":"0.0"},"",""]
[{"$nulls":6},{"v":0,"d":"0.0"},{"v":0,"d":"0.0"},"",""]
[{"$nulls":6},{"v":0,"d":"0.0"},{"v":0,"d":"0.0"},"",""]
[{"$nulls":6},{"v":0,"d":"0.0"},{"v":0,"d":"0.0"},"",""]
[{"$nulls":6},{"v":0,"d":"0.0"},{"v":0,"d":"0.0"},"",""]
[{"$nulls":6},{"v":0,"d":"0.0"},{"v":0,"d":"0.0"},"",""]
[{"$nulls":6},{"v":0,"d":"0.0"},{"v":0,"d":"0.0"},"",""]
[{"$nulls":6},{"v":0,"d":"0.0"},{"v":0,"d":"0.0"},"",""]
[{"$nulls":6},{"v":0,"d":"0.0"},{"v":0,"d":"0.0"},"",""]
{"$rows_left_out":28}
{"sheet":"Viktig","index":1,"n_rows":2,"n_cols":2,"rows_kept":2,"merged":[[0,1,0,10],[1,1,1,10]]}
[null,"Viktig"]
[null,"For å få dette regnearket til å fungere må \"analysis toolpack\" være installert. Dette kan gjøres ved å sjekke boksen \"Tools/Add-Ins…\" fra Excel sin hovedmeny. Dette må kanskje gjøres hver gang du starter Excel."]

{"sheet":"Forutsetninger","index":2,"n_rows":33,"n_cols":5,"rows_kept":33,"merged":[[0,1,0,4],[1,1,1,4]]}
[null,"Forutsetninger og begrensninger"]
[null,"Estimatene i dette regnearket er basert på følgende forutsetninger og begrensninger. Alle endringer til dette kan påvirke estimatene. Opprinnelige forutsetninger og begrensninger finnes i prosjektoppdraget."]
[null,"Nr","Kategori","Beskrivelse","Kommentarer"]
[null,1]
[null,2]
[null,3]
[null,4]
[null,5]
[null,6]
[null,7]
[null,8]
[null,9]
[null,10]
[null,11]
[null,12]
[null,13]
[null,14]
[null,15]
[null,16]
[null,17]
[null,18]
[null,19]
[null,20]
[null,21]
[null,22]
[null,23]
[null,24]
[null,25]
[null,26]
[null,27]
{"$rows_left_out":4}
{"sheet":"Prosjektkostnader","index":3,"n_rows":59,"n_cols":10,"rows_kept":59,"merged":[[0,1,0,9]]}
[null,{"$f":"\"Totalt prosjektestimat for prosjekt \" &Oppsummering!B4:M4","v":"Totalt prosjektestimat for prosjekt <Prosjektnavn>"}]
[null,2]
[]
[{"$nulls":3},"Lav","Sannsynlig","Høy","Forventet","Varians","Avvik"]
[{"$nulls":3},"a","m","b","E(x)","V(x)","a%","b%"]
[null,"Kostnadslinjer","Beskrivelse","MNOK","MNOK","MNOK"]
[{"$nulls":6},{"$f":"IF(AND(D7<>\"\",F7<>\"\"),IF(E7<>\"\",CHOOSE($B$2,(D7+3*E7+F7)/5,(D7+4*E7+F7)/6),(D7+F7)/2),E7)","v":{"v":0,"d":"0.0"}},{"$f":"CHOOSE($B$2,(F7-D7)^2/25,(F7-D7)^2/36)","v":{"v":0,"d":"0.0"}},{"$f":"IF(D7<>0, (1-D7/E7),\"\")","v":""},{"$f":"IF(D7<>0, (F7/E7-1),\"\")","v":""}]
[{"$nulls":6},{"$f":"IF(AND(D8<>\"\",F8<>\"\"),IF(E8<>\"\",CHOOSE($B$2,(D8+3*E8+F8)/5,(D8+4*E8+F8)/6),(D8+F8)/2),E8)","v":{"v":0,"d":"0.0"}},{"$f":"CHOOSE($B$2,(F8-D8)^2/25,(F8-D8)^2/36)","v":{"v":0,"d":"0.0"}},{"$f":"IF(D8<>0, (1-D8/E8),\"\")","v":""},{"$f":"IF(D8<>0, (F8/E8-1),\"\")","v":""}]
[{"$nulls":6},{"$f":"IF(AND(D9<>\"\",F9<>\"\"),IF(E9<>\"\",CHOOSE($B$2,(D9+3*E9+F9)/5,(D9+4*E9+F9)/6),(D9+F9)/2),E9)","v":{"v":0,"d":"0.0"}},{"$f":"CHOOSE($B$2,(F9-D9)^2/25,(F9-D9)^2/36)","v":{"v":0,"d":"0.0"}},{"$f":"IF(D9<>0, (1-D9/E9),\"\")","v":""},{"$f":"IF(D9<>0, (F9/E9-1),\"\")","v":""}]
[{"$nulls":6},{"v":0,"d":"0.0"},{"v":0,"d":"0.0"},"",""]
[{"$nulls":6},{"v":0,"d":"0.0"},{"v":0,"d":"0.0"},"",""]
[{"$nulls":6},{"v":0,"d":"0.0"},{"v":0,"d":"0.0"},"",""]
[{"$nulls":6},{"v":0,"d":"0.0"},{"v":0,"d":"0.0"},"",""]
[{"$nulls":6},{"v":0,"d":"0.0"},{"v":0,"d":"0.0"},"",""]
[{"$nulls":6},{"v":0,"d":"0.0"},{"v":0,"d":"0.0"},"",""]
[{"$nulls":6},{"v":0,"d":"0.0"},{"v":0,"d":"0.0"},"",""]
[{"$nulls":6},{"v":0,"d":"0.0"},{"v":0,"d":"0.0"},"",""]
[{"$nulls":6},{"v":0,"d":"0.0"},{"v":0,"d":"0.0"},"",""]
[{"$nulls":6},{"v":0,"d":"0.0"},{"v":0,"d":"0.0"},"",""]
[{"$nulls":6},{"v":0,"d":"0.0"},{"v":0,"d":"0.0"},"",""]
[{"$nulls":6},{"v":0,"d":"0.0"},{"v":0,"d":"0.0"},"",""]
[{"$nulls":6},{"v":0,"d":"0.0"},{"v":0,"d":"0.0"},"",""]
[{"$nulls":6},{"v":0,"d":"0.0"},{"v":0,"d":"0.0"},"",""]
[{"$nulls":6},{"v":0,"d":"0.0"},{"v":0,"d":"0.0"},"",""]
[{"$nulls":6},{"v":0,"d":"0.0"},{"v":0,"d":"0.0"},"",""]
[{"$nulls":6},{"v":0,"d":"0.0"},{"v":0,"d":"0.0"},"",""]
[{"$nulls":6},{"v":0,"d":"0.0"},{"v":0,"d":"0.0"},"",""]
[{"$nulls":6},{"v":0,"d":"0.0"},{"v":0,"d":"0.0"},"",""]
[{"$nulls":6},{"v":0,"d":"0.0"},{"v":0,"d":"0.0"},"",""]
[{"$nulls":6},{"v":0,"d":"0.0"},{"v":0,"d":"0.0"},"",""]
{"$rows_left_out":30}
{"sheet":"Oppsummering","index":4,"n_rows":38,"n_cols":6,"rows_kept":38,"merged":[[0,1,0,13],[3,1,4,13],[6,1,6,2],[25,1,25,2]]}
[null,"Kost/nytte analyse"]
[]
[{"$nulls":5},"x"]
[null,"<Prosjektnavn>"]
[]
[]
[null,"Kort beskrivelse av prosjektet"]
[]
[]
[]
[]
[]
[]
[null,null,"Totalkostnader (MNOK):",null,{"$f":"+Scoring!C22","v":{"v":0,"d":"0.0"}}]
[null,null,"Tilbakebetalingsperiode (måneder)",null,{"$f":"+Scoring!C33","v":{"v":179.17509228100968,"d":"179"}}]
[null,null,"IRR",null,{"$f":"IF(ISNUMBER('NPV & IRR detaljer'!H3),+Scoring!C34/100,\"NB!\")","v":"NB!"}]
[null,null,"NPV (MNOK)",null,{"$f":"+Scoring!C35","v":{"$error":"#REF!"}}]
[]
[]
[null,null,"Kompleksitet",null,{"$f":"+Scoring!C19","v":{"v":0,"d":"0.0"}}]
[null,null,"Virkning på forretningen",null,{"$f":"+Scoring!C37","v":{"$error":"#VALUE!"}}]
[]
[null,null,"Prosjekttype 1)",null,{"$f":"IF(E21>4.999,IF(E20>4.999,\"Hurtig gevinst\",\"Strategisk\"),IF(E20>4.999,\"Forbedring\",\"Bør ikke startes\"))","v":{"$error":"#VALUE!"}}]
[]
[]
[null,"Konklusjon"]
{"$rows_empty":7}
[null,"1) Definisjon av prosjekttyper"]
[null,"Hurtig gevinst","Score >=5 for Virkning på forretningen og >=5 for Kompleksitet"]
[null,"Strategisk","Score >=5 for Virkning på forretningen og <5 for Kompleksitet"]
{"$rows_left_out":3}
{"sheet":"Gevinstestimat","index":5,"n_rows":71,"n_cols":14,"rows_kept":71,"merged":[[0,1,0,13]]}
[null,{"$f":"\"Årlige gevinster for \" &Oppsummering!B4:M4","v":"Årlige gevinster for <Prosjektnavn>"}]
[null,1]
[{"$nulls":7},"Lav","Sannsynlig","Høy","Forventet","Varians","Avvik"]
[null,"Gevinster",{"$nulls":5},"a","m","b","E(x)","V(x)","a%","b%"]
[]
[null,"Område","Kort beskrivelse av gevinst","Hvordan vil man realisere gevinsten?","Relevant (J/N)","Økonomisk (J/N)","Målbar (J/N)","MNOK","MNOK","MNOK"]
[null,"Økonomi","Unngå kostnader",null,null,"J",{"$nulls":4},{"$f":"IF(E7=\"N\",0,IF(AND(H7<>\"\",J7<>\"\"),IF(I7<>\"\",CHOOSE($B$2,(H7+3*I7+J7)/5,(H7+4*I7+J7)/6),(H7+J7)/2),I7))","v":{"v":0,"d":"0.0"}},{"$f":"IF(E7=\"N\",0,CHOOSE($B$2,(J7-H7)^2/25,(J7-H7)^2/36))","v":{"v":0,"d":"0.0"}},{"$f":"IF(E7=\"N\",\"\",IF(H7<>0, (1-H7/I7),\"\"))","v":""},{"$f":"IF(E7=\"N\",\"\",IF(H7<>0, (J7/I7-1),\"\"))","v":""}]
[null,"Økonomi","Økt inntjening pr aksje",null,null,"J",{"$nulls":4},{"$f":"IF(E8=\"N\",0,IF(AND(H8<>\"\",J8<>\"\"),IF(I8<>\"\",CHOOSE($B$2,(H8+3*I8+J8)/5,(H8+4*I8+J8)/6),(H8+J8)/2),I8))","v":{"v":0,"d":"0.0"}},{"$f":"IF(E8=\"N\",0,CHOOSE($B$2,(J8-H8)^2/25,(J8-H8)^2/36))","v":{"v":0,"d":"0.0"}},{"$f":"IF(E8=\"N\",\"\",IF(H8<>0, (1-H8/I8),\"\"))","v":""},{"$f":"IF(E8=\"N\",\"\",IF(H8<>0, (J8/I8-1),\"\"))","v":""}]
[null,"Økonomi","Økt cashflow",null,null,"J",{"$nulls":4},{"v":0,"d":"0.0"},{"v":0,"d":"0.0"},"",""]
[null,"Økonomi","Økte marginer",null,null,"J",{"$nulls":4},{"v":0,"d":"0.0"},{"v":0,"d":"0.0"},"",""]
[null,"Økonomi","Økt fortjeneste",null,null,"J",{"$nulls":4},{"v":0,"d":"0.0"},{"v":0,"d":"0.0"},"",""]
[null,"Økonomi","Reduserte kostnader",null,null,"J",{"$nulls":4},{"v":0,"d":"0.0"},{"v":0,"d":"0.0"},"",""]
[null,"Økonomi","Reduserte vedlikeholdskostnader",null,null,"J",{"$nulls":4},{"v":0,"d":"0.0"},{"v":0,"d":"0.0"},"",""]
[null,"Interne mål","Forbedret sikkerhet mot systemsvindel",null,null,"J",{"$nulls":4},{"v":0,"d":"0.0"},{"v":0,"d":"0.0"},"",""]
[null,"Interne mål","Redusert behov for høytlønnede arbeidere",null,null,"J",{"$nulls":4},{"v":0,"d":"0.0"},{"v":0,"d":"0.0"},"",""]
[null,"Interne mål","Redusert avgang av personell",null,null,"J",{"$nulls":4},{"v":0,"d":"0.0"},{"v":0,"d":"0.0"},"",""]
[null,"Andre forretningsmål","Prosjektet åpner for nye kunder og nye markeder",null,null,"J",{"$nulls":4},{"v":0,"d":"0.0"},{"v":0,"d":"0.0"},"",""]
[null,"Andre forretningsmål","Løsningen gir firmaet redusert fare for rettslige kostnaden",null,null,"J",{"$nulls":4},{"v":0,"d":"0.0"},{"v":0,"d":"0.0"},"",""]
[null,"Salgs/markedsføringsmål","Økt markedsandel",null,null,"J",{"$nulls":4},{"v":0,"d":"0.0"},{"v":0,"d":"0.0"},"",""]
[null,"Salgs/markedsføringsmål","Økte salgsinntekter",null,null,"J",{"$nulls":4},{"v":0,"d":"0.0"},{"v":0,"d":"0.0"},"",""]
[null,"Funksjonelle/produktivitetsbesparende mål","Økt prosesseringskapasitet/tidsbesparinger for brukerne (gjør samme jobben på kortere tid)",null,null,"N",{"$nulls":4},{"v":0,"d":"0.0"},{"v":0,"d":"0.0"},"",""]
[null,"Funksjonelle/produktivitetsbesparende mål","Gjør det enklere å bruke beste praksis standarder",null,null,"N",{"$nulls":4},{"v":0,"d":"0.0"},{"v":0,"d":"0.0"},"",""]
[null,"Funksjonelle/produktivitetsbesparende mål","Nye produkter og tjenester tilgjengelig",null,null,"N",{"$nulls":4},{"v":0,"d":"0.0"},{"v":0,"d":"0.0"},"",""]
[null,"Rykte","Enklere å følge myndighetskrav",null,null,"N",{"$nulls":4},{"v":0,"d":"0.0"},{"v":0,"d":"0.0"},"",""]
[null,"Rykte","Forbedret leveranseevne",null,null,"N",{"$nulls":4},{"v":0,"d":"0.0"},{"v":0,"d":"0.0"},"",""]
[null,"Rykte","Bedre anseelse som en leder innenfor miljøvern",null,null,"N",{"$nulls":4},{"v":0,"d":"0.0"},{"v":0,"d":"0.0"},"",""]
[null,"Rykte","Forbedret anseelse som en leder innen HSM",null,null,"N",{"$nulls":4},{"v":0,"d":"0.0"},{"v":0,"d":"0.0"},"",""]
[null,"Rykte","Forbedret anseelse som leverandør av høy-teknologi",null,null,"N",{"$nulls":4},{"v":0,"d":"0.0"},{"v":0,"d":"0.0"},"",""]
[null,"Interne mål","Bedre samsvar mellom virkelige og ideelle prosedyrer",null,null,"N",{"$nulls":4},{"v":0,"d":"0.0"},{"v":0,"d":"0.0"},"",""]
[null,"Interne mål","Bedre systemsikkerhet for å forhindre misbruk",null,null,"N",{"$nulls":4},{"v":0,"d":"0.0"},{"v":0,"d":"0.0"},"",""]
{"$rows_left_out":42}
{"sheet":"Scoring","index":6,"n_rows":37,"n_cols":9,"rows_kept":37,"merged":[[0,1,0,8],[1,1,1,8]]}
[null,"Analyse av \"Kompleksitet\" og \"Virkning på forretningen\""]
[null,{"$f":"Oppsummering!B4:M4","v":"<Prosjektnavn>"}]
[]
[null,"Prosjektkompleksitet","Verdi","Enhet","Vekt","Score","Vektet","Type","Kommentar"]
[1,"Hvor sikker er du på at omfanget er definert fullt ut?",null,"%",{"v":1.3,"d":"1.30"},{"$f":"IF(H5=\"EXP\",(1/EXP(C5/3)),IF(H5=\"LIN\",(+C5/100),IF(H5=\"LOG\",IF(C5>0,(1-MAX(0,LOG(C5/100,3))),1),IF(H5=\"SIN\",(SIN((C5-50)*3.14/100)),IF(H5=\"STEP-COS\",(IF(C5<4,1,IF(C5>15,-1,COS((C5*10-30)*3.14/120)))),\"Check type\")))))","v":{"v":-0.9999996829318346,"d":"-1.00"}},{"$f":"+E5*F5","v":{"v":-1.299999587811385,"d":"-1.30"}},"SIN"]
[2,"Har prosjektteamet nødvendig kompetanse for å gjennomføre arbeidet?",null,"%",{"v":1.2,"d":"1.20"},{"v":-0.9999996829318346,"d":"-1.00"},{"v":-1.1999996195182014,"d":"-1.20"},"SIN"]
[3,"Hvor mye av løsningen er i henhold til styrende dokumenter?",null,"%",{"v":0.6,"d":"0.60"},{"v":-0.9999996829318346,"d":"-1.00"},{"v":-0.5999998097591007,"d":"-0.60"},"SIN"]
[4,"Hvor mange prosjekter er man avhengig av for å sette løsningen i drift?",null,"#prosjekter",{"v":0.7,"d":"0.70"},{"v":1,"d":"1.00"},{"v":0.7,"d":"0.70"},"EXP"]
[5,"Hvor forberedt er organisasjonen på å starte å bruke løsningen?",null,"%",{"v":0.7,"d":"0.70"},{"v":-0.9999996829318346,"d":"-1.00"},{"$f":"+E8*F8","v":{"v":0.7,"d":"0.70"}},"SIN"]
[6,"Hvor forberedt er organisasjonen på å ta ut gevinstene?",null,"%",{"v":0.8,"d":"0.80"},{"v":-0.9999996829318346,"d":"-1.00"},{"$f":"+E9*F9","v":{"v":-0.6999997780522842,"d":"-0.70"}},"SIN"]
[7,"Hvor mye av nødvendig forretningskompetanse er tilgjengelig i organisasjonen?",null,"%",{"v":0.5,"d":"0.50"},{"v":0,"d":"0.00"},{"v":0,"d":"0.00"},"LIN"]
[8,"Hvor sikker er du på tilgjengelighet på ressurser fra forretningen?",null,"%",{"v":0.9,"d":"0.90"},{"v":0,"d":"0.00"},{"v":0,"d":"0.00"},"LIN"]
[9,"Hvor sikker er du på tilgjengelighet på ressurser fra leverandørene?",null,"%",{"v":0.9,"d":"0.90"},{"v":0,"d":"0.00"},{"v":0,"d":"0.00"},"LIN"," "]
[10,"Hvor mange brukere må ha opplæring for å benytte løsningen?",null,"#brukere",{"v":0.5,"d":"0.50"},{"v":1,"d":"1.00"},{"v":0.5,"d":"0.50"},"LOG"]
[11,"Hvor mange brukere må informeres om implementering av løsningen?",null,"#brukere",{"v":0.3,"d":"0.30"},{"v":1,"d":"1.00"},{"v":0.3,"d":"0.30"},"LOG"]
[12,"Hvor mange dager opplæring forventes pr bruker?",null,"#dager",{"v":0.3,"d":"0.30"},{"v":1,"d":"1.00"},{"v":0.3,"d":"0.30"},"LOG"]
[13,"Prosjektets varighet",null,"måneder",{"v":0.6,"d":"0.60"},{"v":1,"d":"1.00"},{"v":0.6,"d":"0.60"},"STEP-COS"]
[]
[null,"Total score for prosjektkompleksitet",{"$f":"+MAX(0,G19)","v":{"v":0,"d":"0.0"}},null,{"$f":"SUM(E5:E18)","v":9.300000000000002},{"$f":"SUM(F5:F18)","v":{"v":1.5853408270594116E-6,"d":"0.00"}},{"$f":"SUM(G5:G18)","v":{"v":-0.6999987951409713,"d":"-0.70"}}]
[]
[null,"Virkning på forretningen","Verdi","Enhet","Vekt","Score","Vektet","Type","Kommentar"]
[1,"Totalt prosjektestimat",{"$f":"Prosjektkostnader!G57","v":{"v":0,"d":"0.00"}},"MNOK"]
[2,"Estimerte endringer i årlige driftskostnader",{"$f":"Driftskostnader!G55","v":{"v":0,"d":"0.00"}},"MNOK"]
[3,"Antall måneder fra driftsstart til full cash-flow",null,"måneder"]
[4,"Effektiv levetid for prosjektproduktet",null,"måneder"]
[5,"Estimerte årlige gevinster (E(x))",{"$f":"Gevinstestimat!K69","v":{"v":0,"d":"0.00"}},"MNOK"]
[6,"Økonomiske konsekvenser ved å ikke kjøre prosjektet",null,"MNOK"]
[7,"Andel av cash-flow direkte avhengig av denne delen av prosjektet",null,"%"]
[8,"Diskonteringsrente",{"v":8,"d":"8.0"},"%"]
[]
{"$rows_left_out":8}
{"sheet":"NPV & IRR detaljer","index":7,"n_rows":270,"n_cols":10,"rows_kept":270}
[null,null,"Årlig","Månedlig"]
[null,"Totale prosjektkostnader",{"$f":"Scoring!C22","v":0},{"$f":"+C2/C4","v":{"$error":"#DIV/0!"}},"MNOK",null,"Diskonteringsrente","IRR","NPV","Tilbakebetalingsperiode"]
[null,"Årlige driftskostnader",{"$f":"+Scoring!C23","v":0},{"$f":"+C3/12","v":{"v":0,"d":"0.00"}},"MNOK",null,{"$f":"NOMINAL(G4/12,12)","v":{"v":0.006646382639412529,"d":"0.7%"}},{"$f":"IRR(OFFSET(F11,0,0,C8-1,1),0.01)","v":{"$error":"#NUM!"}},{"$f":"NPV(G3,OFFSET(F11,0,0,C8,1))","v":{"$error":"#REF!"}}]
[null,"Prosjektets varighet",{"$f":"Scoring!C17","v":0},{"$f":"+C4+1","v":1},"måneder",null,{"$f":"Scoring!C29/100","v":{"v":0.08,"d":"8.0%"}},{"$f":"IF(ISNUMBER(H3),IF(+H3>0,EFFECT(H3*12,12),EFFECT(-1*H3*12,12)*-1),\"NB!\")","v":"NB!"},{"$f":"+I3","v":{"$error":"#REF!"}},{"$f":"+MAX(H11:H130)","v":{"v":179.17509228100968,"d":"179.18"}}]
[null,"Gevinster",{"$f":"+(Scoring!C26+Scoring!C27)*Scoring!C28/100","v":0},{"$f":"+C5/12","v":{"v":0,"d":"0.00"}},"MNOK/mnd"]
[null,"Fullt gevinstuttak etter",{"$f":"Scoring!C24","v":0},{"$f":"+D5/C6","v":{"$error":"#DIV/0!"}},"MNOK/mnd"]
[null,"Levetid",{"$f":"Scoring!C25","v":0},null,"måneder"]
[null,"Varighet",{"$f":"+C4+C7","v":0},null,"måneder"]
[]
[null,"Måned","Prosjektkostnader","Driftskostnader","Gevinster","Månedlig","Akkumulert","Intercept"]
[null,1,{"v":0.05,"d":"0"},0,0,-0.05,{"v":-0.05,"d":"-0 "},{"v":124.11539770876463,"d":"124.12"}]
[null,2,{"v":0.05,"d":"0"},0,0,-0.05,{"v":-0.1,"d":"-0 "},{"v":124.60227872976783,"d":"124.60"}]
[null,3,{"v":0.05,"d":"0"},0,0,-0.05,{"v":-0.15000000000000002,"d":"-0 "},{"v":125.08882887114177,"d":"125.09"}]
[null,4,{"v":0.05,"d":"0"},0,0,-0.05,{"v":-0.2,"d":"-0 "},{"v":125.57504546507504,"d":"125.58"}]
[null,5,{"v":0.05,"d":"0"},0,0,-0.05,{"v":-0.25,"d":"-0 "},{"v":126.06092587349272,"d":"126.06"}]
[null,6,{"v":0.05,"d":"0"},0,0,-0.05,{"v":-0.3,"d":"-0 "},{"v":126.54646748786942,"d":"126.55"}]
[null,7,{"v":0.05,"d":"0"},0,0,-0.05,{"v":-0.35,"d":"-0 "},{"v":127.03166772903725,"d":"127.03"}]
[null,8,{"v":0.05,"d":"0"},0,0,-0.05,{"v":-0.39999999999999997,"d":"-0 "},{"v":127.51652404698918,"d":"127.52"}]
[null,9,{"v":0.05,"d":"0"},0,0,-0.05,{"v":-0.44999999999999996,"d":"-0 "},{"v":128.0010339206773,"d":"128.00"}]
[null,10,{"v":0.05,"d":"0"},0,0,-0.05,{"v":-0.49999999999999994,"d":"-1 "},{"v":128.48519485780602,"d":"128.49"}]
[null,11,{"v":0.05,"d":"0"},0,0,-0.05,{"v":-0.5499999999999999,"d":"-1 "},{"v":128.96900439462033,"d":"128.97"}]
[null,12,{"v":0.05,"d":"0"},0,0,-0.05,{"v":-0.6,"d":"-1 "},{"v":129.45246009568854,"d":"129.45"}]
[null,13,{"v":0.05,"d":"0"},0,0,-0.05,{"v":-0.65,"d":"-1 "},{"v":129.93555955368,"d":"129.94"}]
[null,14,{"v":0.05,"d":"0"},0,0,-0.05,{"v":-0.7000000000000001,"d":"-1 "},{"v":130.41830038913733,"d":"130.42"}]
[null,15,{"v":0.05,"d":"0"},0,0,-0.05,{"v":-0.7500000000000001,"d":"-1 "},{"v":130.9006802502429,"d":"130.90"}]
[null,16,{"v":0.05,"d":"0"},0,0,-0.05,{"v":-0.8000000000000002,"d":"-1 "},{"v":131.3826968125801,"d":"131.38"}]
[null,17,{"v":0.05,"d":"0"},0,0,-0.05,{"v":-0.8500000000000002,"d":"-1 "},{"v":131.86434777888837,"d":"131.86"}]
[null,18,{"v":0.05,"d":"0"},0,0,-0.05,{"v":-0.9000000000000002,"d":"-1 "},{"v":132.34563087881278,"d":"132.35"}]
[null,19,{"v":0.05,"d":"0"},0,0,-0.05,{"v":-0.9500000000000003,"d":"-1 "},{"v":132.82654386864746,"d":"132.83"}]
[null,20,{"v":0.05,"d":"0"},0,0,-0.05,{"v":-1.0000000000000002,"d":"-1 "},{"v":133.30708453107272,"d":"133.31"}]
{"$rows_left_out":241}
{"sheet":"Factors","index":9,"n_rows":64,"n_cols":4,"rows_kept":64,"hidden":true}
[]
["Percent","Linear (int)","Peek (ext)","Sinus"]
[0,{"$f":"+A3/100","v":{"v":0,"d":"0.00"}},{"$f":"+(A3-50)*(A3-50)/2500","v":1},{"$f":"SIN((A3-50)*3.14/100)","v":{"v":-0.9999996829318346,"d":"-1.00"}}]
[10,{"$f":"+A4/100","v":{"v":0.1,"d":"0.10"}},{"$f":"+(A4-50)*(A4-50)/2500","v":0.64},{"v":-0.95085946050647,"d":"-0.95"}]
[20,{"v":0.2,"d":"0.20"},0.36,{"v":-0.8087360605531302,"d":"-0.81"}]
[30,{"v":0.3,"d":"0.30"},0.16,{"v":-0.5875275257138919,"d":"-0.59"}]
[40,{"v":0.4,"d":"0.40"},0.04,{"v":-0.30886552009893214,"d":"-0.31"}]
[50,{"v":0.5,"d":"0.50"},0,{"v":0,"d":"0.00"}]
[60,{"v":0.6,"d":"0.60"},0.04,{"v":0.30886552009893214,"d":"0.31"}]
[70,{"v":0.7,"d":"0.70"},0.16,{"v":0.5875275257138919,"d":"0.59"}]
[80,{"v":0.8,"d":"0.80"},0.36,{"v":0.8087360605531302,"d":"0.81"}]
[90,{"v":0.9,"d":"0.90"},0.64,{"v":0.95085946050647,"d":"0.95"}]
[100,{"v":1,"d":"1.00"},1,{"v":0.9999996829318346,"d":"1.00"}]
[]
["Number","Exp (int,proj)","Step-log (dur)","StepCosinus"]
[0,{"$f":"1/EXP(A16/3)","v":{"v":1,"d":"1.00"}},1,{"$f":"IF(A16<4,1,IF(A16>15,-1,COS((A16*10-30)*3.14/120)))","v":{"v":1,"d":"1.00"}}]
[1,{"$f":"1/EXP(A17/3)","v":{"v":0.7165313105737893,"d":"0.72"}},{"$f":"+MAX(-2,1-MAX(0,LOG(A17/3,2)))","v":{"v":1,"d":"1.00"}},{"$f":"IF(A17<4,1,IF(A17>15,-1,COS((A17*10-30)*3.14/120)))","v":{"v":1,"d":"1.00"}}]
[2,{"v":0.513417119032592,"d":"0.51"},{"v":1,"d":"1.00"},{"v":1,"d":"1.00"}]
[3,{"v":0.36787944117144233,"d":"0.37"},{"v":1,"d":"1.00"},{"v":1,"d":"1.00"}]
[4,{"v":0.26359713811572677,"d":"0.26"},{"v":0.5849625007211563,"d":"0.58"},{"v":0.9659601685383986,"d":"0.97"}]
[5,{"v":0.18887560283756183,"d":"0.19"},{"v":0.2630344058337938,"d":"0.26"},{"v":0.866158094405463,"d":"0.87"}]
[6,{"v":0.1353352832366127,"d":"0.14"},{"v":0,"d":"0.00"},{"v":0.7073882691671998,"d":"0.71"}]
[7,{"v":0.09697196786440505,"d":"0.10"},{"v":-0.2223924213364481,"d":"-0.22"},{"v":0.5004596890082058,"d":"0.50"}]
[8,{"v":0.06948345122280154,"d":"0.07"},{"v":-0.4150374992788437,"d":"-0.42"},{"v":0.2594599819148823,"d":"0.26"}]
[9,{"v":0.049787068367863944,"d":"0.05"},{"v":-0.5849625007211563,"d":"-0.58"},{"v":7.9632671073326335E-4,"d":"0.00"}]
[10,{"v":0.03567399334725239,"d":"0.04"},{"v":-0.7369655941662063,"d":"-0.74"},{"v":-0.2579215421474592,"d":"-0.26"}]
[11,{"v":0.025561533206507402,"d":"0.03"},{"$f":"+MAX(-2,1-MAX(0,LOG(A27/3,2)))","v":{"v":-0.8744691179161412,"d":"-0.87"}},{"v":-0.4990801993556198,"d":"-0.50"}]
[12,{"v":0.018315638888734182,"d":"0.02"},{"v":-1,"d":"-1.00"},{"v":-0.7062616448200052,"d":"-0.71"}]
[13,{"v":0.013123728736940968,"d":"0.01"},{"v":-1.115477217419936,"d":"-1.12"},{"v":-0.8653610355694579,"d":"-0.87"}]
[14,{"v":0.009403562551495206,"d":"0.01"},{"v":-1.222392421336448,"d":"-1.22"},{"v":-0.9655469387104683,"d":"-0.97"}]
{"$rows_left_out":25}